{"text_format":"1","workbook":"xlsx","n_sheets":11,"sheets":["BASE","CALIFICACIONES","INF. DE ALUMNO","INF. DE SALON","SUELDO DE PROFESORES","INSCRIPCION","BOLETAS","DATOS DEL ALUMNOS DE NUEVO ING.","HORARIO DE TALLER","INVENTARIO","ALUMNOS PARA BECA"],"not_rendered":{"charts":0,"images":0,"macros":1,"external_links":0,"defined_names":0,"comments":0,"pivot_tables":0},"unopened":[],"bounds":{"document_bytes":16777216,"sheet_cells":100000,"rows_first":2000,"rows_last":500,"rows_between":2000,"halvings":0,"cell_chars":16384,"cell_head_chars":4096},"cells_cut":0,"cells_raw":0,"read":"whole","date_system":"1900"}

{"sheet":"BASE","index":0,"n_rows":55,"n_cols":31,"rows_kept":55,"cut":false,"hidden":false,"merged":[[1,27,1,28],[1,29,2,29],[18,8,18,12],[0,8,0,13],[0,0,0,5],[2,24,18,24],[1,25,1,26]]}
["ALUMNOS",null,null,null,null,null,null,null,"PROFESORES"]
["MATRICULA","NOMBRE","SEMESTRE","GRUPO","E-MAIL","NUMERO TELEFONICO",null,null,"N° DE PLAZA","PROFESOR","MATERIA","SUELDO ","CREDITOS","SUELDO TOTAL MENSUAL",null,null,"NOMBRE ","LUGAR DE NACIMIENTO",null,"ESTADO","FECHA DE NACIMIENTO","EDAD ","SEXO","CARRERA ELEGIDA",null,"MATEMATICAS",null,"ESPAÑOL",null,"PROMEDIO"]
["B130012","JUAN JOSE PEDROSA MENDEZ",2,"K","juan@hotmail.com",9621789542,null,null,"N°2525252225","CARLOS ALESSIO PEREZ","INGLES",5000,500,{"$f":"SUM(L3+M3)","v":5500},null,null,"AGUILAR PEREZ MARIO","CACAHUATAN",null,"CHIAPAS","2014-02-09",18,"H","SISTEMAS","EAMEN DE SELECCIÓN","EX1","CALCULO","LECTURA","REDACCION"]
["B130023","ALEXIS MOLINA MENDEZ",2,"K","alex@hotmail.com",9621365478,null,null,"N°2525654222","EDUARDO DE JESUS REYES","DERECHO",5000,200,{"$f":"SUM(L4+M4)","v":5200},null,null,"ALEXIS SALGADO MOLINA","CIUDAD HIDALGO ",null,"CHIAPAS","2014-02-10",19,"H","CONTADURIA",null,6,8,10,8,{"$f":"AVERAGE(Z4,AA4,AB4,AC4)","v":8},{"$f":"IF(AD4<6,\"REPROBADO\",\"APROBADO\")","v":"APROBADO"}]
["B130031","ANGEL GUILLERMO PEREZ PEREZ",2,"K","angel@hotmail.com",9621659836,null,null,"N°6524215856","OMAR JIMENEZ BAMACA","ADMINISTRACION",6000,300,6300,null,null,"ALFARO MENDEZ PEDRO","COMITAN",null,"CHIAPAS","2014-02-11",21,"H","CONTADURIA",null,5,5,5,5,{"$f":"AVERAGE(Z5,AA5,AB5,AC5)","v":5},{"$f":"IF(AD5<6,\"REPROBADO\",\"APROBADO\")","v":"REPROBADO"}]
["B130032","AURORA LUZ ANGEL",2,"K","auro@hotmail.com",9621458966,null,null,"N°9789874651","ADRIAN MORERO CRUZ","CONTADURIA",9999,500,10499,null,null,"ANGEL GUILLERMO GUZMON BARRIOS","FRONTERA COMALAPA",null,"CHIAPAS","2014-02-12",18,"H","SISTEMAS",null,8,9,5,10,8,"APROBADO"]
["B130025","BRENDA ISAELA ALESSIO",2,"K","brenda@hotmail.com",9624569368,null,null,"N°9876545613","MABEL ADRIANA DUQUE PAIZ","COMPUTACION",4200,500,4700,null,null,"CARLOS ISRAEL ALESSIO PEREZ","FRONTERA, COMALAPA",null,"CHIAPAS","2014-02-13",19,"H","SISTEMAS",null,8,9,9,8,8.5,"APROBADO"]
["B130054","CARLOS ISRAEL VASQUEZ TORIBIO",2,"K","carlos@hotmail.com",9624568791,null,null,"N°9876312658","LAURA CISNEROS FUENTES","ECONOMIA",3000,250,3250,null,null,"CASTELLANOS BARRIOS VERONICA","FRONTERA, HIDALGO",null,"CHIAPAS","2014-02-14",20,"H","SISTEMAS",null,8,9,9,8,8.5,"APROBADO"]
["B130068","CIRO NAKAMURHA LOO",2,"K","ciro@hotmail.com",9624532698,null,null,"N°8903214786","FRANCISCO PEREZ ORTEGA","MATEMATICAS",2300,150,2450,null,null,"CRISTIAN GODINES","LA TRANITARIA",null,"CHIAPAS","2014-02-15",20,"H","CONTADURIA",null,5,9,6,8,7,"APROBADO"]
["B130066","EDUARDO TOLEDO TOLEDO",2,"K","eduardo@hotmail.com",9624563259,null,null,"N°9876105644","ORLANDO PRADO SOTO","APRENDER A APRENDER",3600,360,3960,null,null,"CRUZ TOLEDO HENRRY","LAS MARGARITAS",null,"CHIAPAS","2014-02-16",18,"M","SISTEMAS",null,5,5,5,5,5,"REPROBADO"]
["B130047","FERNANDO MENDEZ MENDEZ",2,"K","fernando@hotmail.com",9623568941,null,null,null,null,null,null,null,null,null,null,"FRANCISCO EDUARDO PEREZ PEREZ","MAPASTEPEC",null,"CHIAPAS","2014-02-17",19,"H","CONTADURIA",null,9,8,8,9,8.5,"APROBADO"]
["B130024","JAZMIN PEDROSA PEDROSA",2,"K","jazmin@hotmail.com",9623547896,null,null,null,null,null,null,null,null,null,null,"GILBERTO RAMOS BARRON","METAPA, DE DOMINGUEZ",null,"CHIAPAS","2014-02-18",22,"H","CONTADURIA",null,8,8,8,9,8.25,"APROBADO"]
["B130044","JESUS REYES TOLEDO",2,"K","jesus@hotmail.com",9620364586,null,null,null,null,null,null,null,null,null,null,"HERNANDEZ RAMOS BRENDA","OCOZOCUAUTLA",null,"CHIAPAS","2014-02-19",20,"H","CONTADURIA",null,4,8,8,10,7.5,"APROBADO"]
["B130087","LIZBETH GUERRERO CRUZ",2,"K","lizbeth@hotmail.com",9620356666,null,null,null,null,null,null,null,null,null,null,"JOSE BENITO PEREZ ARMIENTO","PIJIJIAPAN",null,"CHIAPAS","2014-02-20",19,"H","SISTEMAS",null,4,7,8,8,6.75,"APROBADO"]
["B130077","MARIA ELENA CRUZ CRUZ",2,"K","maria@hotmail.com",9621001004,null,null,null,null,null,null,null,null,null,null,"JOSEFINA DEL VAZQUEZ MOTA","SUCHIAPA",null,"CHIAPAS","2014-02-21",18,"H","CONTADURIA ",null,5,5,5,8,5.75,"REPROBADO"]
["B130054","OMAR CRUZ VASQUEZ",2,"K","omar@hotmail.com",9624446679,null,null,null,null,null,null,null,null,null,null,"KEVIN DE LA CRUZ","TAPACHULA ",null,"CHIAPAS","2014-02-22",20,"H","SISTEMAS",null,7,7,9,8,7.75,"APROBADO"]
["B130069","PEDRO FERNANDEZ MUTUO",2,"K","pedro@hotmail.com",9625478963,null,null,null,null,null,null,null,null,null,null,"MARIO PEREZ CANTIFLAS","TONALA",null,"CHIAPAS","2014-02-23",19,"M","SISTEMAS",null,7,4,9,9,7.25,"APROBADO"]
[" ",null,null,null,null,null,null,null,null,null,null,null,null,null,null,null,"MARTIN PEREZ LOPEZ","TUXTLA CHICO",null,"CHIAPAS","2014-02-24",19,"H","CONTADURIA",null,7,4,9,9,7.25,"APROBADO"]
["MATRICULA","NOMBRE "," SEMESTRE","GRUPO","E-MAIL","TELEFONO","LICENCIATURA",null,"MOBILIARIO Y EQUIPO",null,null,null,null,null,null,null,"OMAR CRUZ VASQUEZ","ZINACANTAN",null,"CHIAPAS","2014-02-25",18,"M","CONTADURIA",null,8,4,8,9,7.25,"APROBADO"]
["B130052","AGUILAR PEREZ MARIO",1,"A","perez_34@hotmail.com",9621789542,"CONTADURIA",null,"MOBILIARIO O EQUIPO","CANTIDAD","AÑO DE EQUIPAMIENTO","PROVEEDORES","PRECIO UNITARIO"]
["B130053","ALFARO MENDEZ PEDRO",2,"D","pedro23@hotmail.com",9621365478,"SISTEMAS",null,"VENTANAS",10,2010,"HOME DEPOT",500]
["B130054","CASTELLANOS BARRIOS VERONICA",3,"F","vero25@hotmail.com",9621659836,"CONTADURIA",null,"ESCRITORIOS",30,2012,"OFFICE DEPOT",600]
["B130055","CRUZ TOLEDO HENRRY",4,"I","hery4@hotmail.com",9621458966,"CONTADURIA",null,"COMPUTADORAS",50,2011,"DELL",300]
["B130056","HERNANDEZ RAMOS BRENDA",5,"C","brend636@hotmail.com",9624569368,"CONTADURIA",null,"PIZARRONES",66,2010,"MARKER",100]
["B130057","HIDALGO SOLIS VICTORIA",6,"E","Hsolis@hotmail.com",9624568791,"CONTADURIA",null,"PAPELERIA Y UTILES",50,2014,"TONY",200]
["B130058","MENDEZ MOLINA JESUS",7,"C","JMolina@hotmail.com",9624532698,"SISTEMAS",null,"IMPRESORAS",20,2013,"TINTA RAPIDA S.A DE C.V",300]
["B130059","PEREZ ALVARADO INGRITH",8,"B","estrellita@hotmail.com",9623568941,"SISTEMAS",null,"LAMPARAS",44,2012,"LUZ S.A DE C.V",520]
["B130060","RAMOS MORENO JORGE",9,"A","jramos@hotmail.com",9623547896,"SISTEMAS",null,"AIRE ACONDICIONADO",99,2012,"CLIMAFRESCO S.A DE C.V",800]
[null,null,null,null,null,null,null,null,"VENTILADORES",30,2011,"VENTILADORES DEL SUR S.A DE C.V",600]
[null,null,"SEMESTRE","PAGO POR SEMESTRE",null,null,null,null,"PUPITRES",3,2013,"LOS PINOS S.A DE C.V",200]
[null,null,1,750,null,null,null,null,"MESABANCOS",55,2010,"MOBI S.A DE C.V",400]
[null,null,2,800]
[null,null,3,850]
[null,null,4,900]
[null,null,5,925]
[null,null,6,950]
[null,null,7,975]
[null,null,8,975]
[null,null,9,1000]
[]
{"$rows_left_out":16}
{"sheet":"CALIFICACIONES","index":1,"n_rows":24,"n_cols":49,"rows_kept":24,"cut":false,"hidden":false,"merged":[[2,43,2,45],[1,37,1,45],[3,2,18,2],[20,37,20,45],[2,17,2,19],[1,17,1,25],[2,27,2,31],[2,32,2,35],[1,27,1,35],[2,37,2,39],[2,3,2,5],[2,6,2,10],[2,11,2,15],[1,3,1,15],[2,23,2,25],[20,17,20,20],[21,17,21,19],[20,27,20,30],[2,40,2,42],[23,37,23,38],[20,2,20,4],[21,2,21,3],[22,2,22,3],[23,2,23,3]]}
[]
[null,null,null,"PROCESO CONTABLE",null,null,null,null,null,null,null,null,null,null,null,null,null,"DERECHO",null,null,null,null,null,null,null,null,null,"MATEMATICAS",null,null,null,null,null,null,null,null,null,"HERRAMIENTAS AVANZADAS DE COMPUTACION"]
[null,null,null,"TRABAJOS",null,null,"PRACTICAS",null,null,null,null,"EXAMENES",null,null,null,null,"CALIFICACION","EXPOSICIONES",null,null,"TRABAJOS",null,null,"EXAMEN",null,null,"CALIFICACION","TRABAJOS",null,null,null,null,"EXAMEN",null,null,null,"CALIFICACION","WORD",null,null,"EXCEL",null,null,"C++",null,null,"CALIFICACION","PROMEDIO"]
[{"$f":"BASE!A2","v":"MATRICULA"},{"$f":"BASE!B2","v":"NOMBRE"},"CALIFICACIONES DEL PARCIAL","T1","T2","T3","P1","P2","P3","P4","P5","E1","E2","E3","E4","E5",null,"E1","E2","E3","T1","T2","T3","EX1","EX2","EX3",null,"T1","T2","T3","T4","T5","EX1","EX2","EX3","EX4",null,"W1","W2","W3","E1","E2","E3","C1","C2","C3"]
[{"$f":"BASE!A3","v":"B130012"},{"$f":"BASE!B3","v":"JUAN JOSE PEDROSA MENDEZ"},null,10,9,8,8,8,10,8,10,9,8,9,10,9,{"$f":"ROUND((AVERAGE(D5:F5)*$E$22)+(AVERAGE(G5:K5)*$E$23)+(AVERAGE(L5:P5)*$E$24),2)","v":8.9499999999999993},10,8,9,10,8,9,10,9,9,{"$f":"ROUND((AVERAGE(R5:T5)*$U$22)+(AVERAGE(U5:W5)*$U$23)+(AVERAGE(X5:Z5)*$U$24),2)","v":9.1999999999999993},10,9,8,10,10,10,10,10,10,{"$f":"ROUND((AVERAGE(AB5:AF5)*$AE$22)+(AVERAGE(AG5:AJ5)*$AE$23),2)","v":9.82},10,9,7,10,9,9,8,9,6,{"$f":"ROUND((AVERAGE(AL5:AN5)*$AN$22)+(AVERAGE(AO5:AQ5)*$AN$23)+(AVERAGE(AR5:AT5)*$AN$24),2)","v":9.75},{"$f":"AVERAGE(Q5,AA5,AK5,AU5)","v":9.43},{"$f":"IF(AV5>6,\"APROBADO\",\"REPROBADO\")","v":"APROBADO"}]
[{"$f":"BASE!A4","v":"B130023"},{"$f":"BASE!B4","v":"ALEXIS MOLINA MENDEZ"},null,8,6,8,5,9,10,8,7,8,9,9,8,9,{"$f":"ROUND((AVERAGE(D6:F6)*$E$22)+(AVERAGE(G6:K6)*$E$23)+(AVERAGE(L6:P6)*$E$24),2)","v":8.08},9,10,8,9,8,9,9,8,9,{"$f":"ROUND((AVERAGE(R6:T6)*$U$22)+(AVERAGE(U6:W6)*$U$23)+(AVERAGE(X6:Z6)*$U$24),2)","v":8.6999999999999993},10,9,8,10,9,9,9,9,9,{"$f":"ROUND((AVERAGE(AB6:AF6)*$AE$22)+(AVERAGE(AG6:AJ6)*$AE$23),2)","v":9.06},8,9,8,8,9,9,8,5,6,{"$f":"ROUND((AVERAGE(AL6:AN6)*$AN$22)+(AVERAGE(AO6:AQ6)*$AN$23)+(AVERAGE(AR6:AT6)*$AN$24),2)","v":8.9},{"$f":"AVERAGE(Q6,AA6,AK6,AU6)","v":8.6850000000000005},"APROBADO"]
[{"$f":"BASE!A5","v":"B130031"},{"$f":"BASE!B5","v":"ANGEL GUILLERMO PEREZ PEREZ"},null,10,7,6,8,7,10,9,8,9,7,9,10,9,8.42,8,7,10,8,4,8,8,8,9,7.83,9,9,8,9,8,8,8,8,8,8.18,9,9,8,9,9,9,8,5,6,9.18,8.4024999999999999,"APROBADO"]
[{"$f":"BASE!A6","v":"B130032"},{"$f":"BASE!B6","v":"AURORA LUZ ANGEL"},null,5,9,7,5,4,10,7,9,9,8,9,10,8,7.9,9,6,10,10,5,9,9,8,9,8.43,7,7,8,10,8,8,9,9,10,8.6999999999999993,9,9,8,9,9,9,8,9,6,9.52,8.6374999999999993,"APROBADO"]
[{"$f":"BASE!A7","v":"B130025"},{"$f":"BASE!B7","v":"BRENDA ISAELA ALESSIO"},null,8,9,7,4,5,8,5,9,8,9,9,8,7,7.65,8,5,10,9,6,8,8,8,9,8.07,7,8,8,8,7,9,7,8,8,7.88,8,9,8,9,5,9,8,8,9,8.6999999999999993,8.0749999999999993,"APROBADO"]
[{"$f":"BASE!A8","v":"B130054"},{"$f":"BASE!B8","v":"CARLOS ISRAEL VASQUEZ TORIBIO"},null,6,8,9,3,6,9,6,9,7,8,9,8,8,7.57,9,7,8,9,2,9,10,8,8,8,10,8,8,8,9,10,7,9,10,8.8800000000000008,9,9,9,9,5,9,8,8,9,8.8000000000000007,8.3125,"APROBADO"]
[{"$f":"BASE!A9","v":"B130068"},{"$f":"BASE!B9","v":"CIRO NAKAMURHA LOO"},null,9,7,10,6,2,7,3,8,6,9,8,7,8,7.27,7,10,9,9,9,8,9,7,8,8.27,8,8,8,7,7,8,8,8,9,8.06,8,9,9,8,5,9,8,7,8,8.35,7.9875000000000007,"APROBADO"]
[{"$f":"BASE!A10","v":"B130066"},{"$f":"BASE!B10","v":"EDUARDO TOLEDO TOLEDO"},null,9,8,6,9,1,8,4,7,6,9,9,7,7,7.17,9,6,8,8,9,9,8,7,8,7.97,9,9,8,10,9,7,8,9,10,8.65,9,9,9,8,6,9,8,7,7,8.5500000000000007,8.0850000000000009,"APROBADO"]
[{"$f":"BASE!A11","v":"B130047"},{"$f":"BASE!B11","v":"FERNANDO MENDEZ MENDEZ"},null,10,8,9,8,9,4,9,7,6,9,8,6,7,7.7,8,9,8,7,7,8,9,7,8,7.83,8,9,8,8,8,10,8,9,9,8.76,5,9,7,5,6,9,8,7,9,7.72,8.0024999999999995,"APROBADO"]
[{"$f":"BASE!A12","v":"B130024"},{"$f":"BASE!B12","v":"JAZMIN PEDROSA PEDROSA"},null,10,10,9,6,8,6,4,8,9,8,7,8,9,8.1199999999999992,7,6,7,7,7,9,10,9,6,7.97,9,9,8,9,9,8,10,10,9,9.1199999999999992,8,9,7,5,6,8,8,8,9,7.72,8.2324999999999999,"APROBADO"]
[{"$f":"BASE!A13","v":"B130044"},{"$f":"BASE!B13","v":"JESUS REYES TOLEDO"},null,9,5,10,6,6,5,9,5,5,5,5,5,5,6.05,8,8,5,5,5,8,8,9,6,7.1,10,0,5,0,5,5,0,8,7,4.7,9,0,5,5,5,5,8,5,9,6.03,5.97,"REPROBADO"]
[{"$f":"BASE!A14","v":"B130087"},{"$f":"BASE!B14","v":"LIZBETH GUERRERO CRUZ"},null,10,5,7,6,8,3,8,6,6,8,8,9,9,7.38,7,7,9,8,9,9,7,9,6,7.77,9,9,8,9,7,8,9,9,8,8.4700000000000006,8,8,9,7,7,8,8,9,9,8.5500000000000007,8.0425000000000004,"APROBADO"]
[{"$f":"BASE!A15","v":"B130077"},{"$f":"BASE!B15","v":"MARIA ELENA CRUZ CRUZ"},null,8,9,7,3,9,9,7,6,7,7,6,9,9,7.5,9,8,7,9,9,8,10,9,7,8.6,10,8,8,8,10,9,9,9,6,8.42,8,8,8,7,8,7,8,9,9,8.5,8.2550000000000008,"APROBADO"]
[{"$f":"BASE!A16","v":"B130054"},{"$f":"BASE!B16","v":"OMAR CRUZ VASQUEZ"},null,9,9,9,7,7,5,5,6,8,8,8,9,8,7.85,9,8,9,8,9,9,10,9,7,8.67,10,9,8,10,8,9,8,8,10,8.83,8,8,8,7,8,7,8,8,9,8.42,8.4425000000000008,"APROBADO"]
[{"$f":"BASE!A17","v":"B130069"},{"$f":"BASE!B17","v":"PEDRO FERNANDEZ MUTUO"},null,7,8,5,5,8,7,3,8,6,8,7,8,8,6.92,9,8,6,8,9,8,9,9,10,8.8699999999999992,9,9,8,10,8,8,9,9,9,8.77,8,8,8,7,8,7,8,8,9,8.42,8.2449999999999992,"APROBADO"]
[]
[null,null,"PROCESO CONTABLE",null,null,null,null,null,null,null,null,null,null,null,null,null,null,"DERECHO",null,null,null,null,null,null,null,null,null,"MATEMATICAS",null,null,null,null,null,null,null,null,null,"HERRAMIENTAS AVANZADAS DE COMPUTACION"]
[null,null,"TRABAJOS",null,0.25,null,null,null,null,null,null,null,null,null,null,null,null,"EXPOSICIONES",null,null,0.1,null,null,null,null,null,null,"TRABAJOS",null,null,0.3,null,null,null,null,null,null,"WORD",null,0.15]
[null,null,"PRACTICAS",null,0.25,null,null,null,null,null,null,null,null,null,null,null,null,"TRABAJOS",null,null,0.3,null,null,null,null,null,null,"EXAMENES",null,null,0.7,null,null,null,null,null,null,"EXCEL",null,0.7]
[null,null,"EXAMENES",null,0.5,null,null,null,null,null,null,null,null,null,null,null,null,"EXAMENES",null,null,0.6,null,null,null,null,null,null,null,null,null,null,null,null,null,null,null,null,"C++",null,0.25]

{"sheet":"INF. DE ALUMNO","index":2,"n_rows":3,"n_cols":9,"rows_kept":3,"cut":false,"hidden":false,"merged":[]}
[]
[null,"MATRICULA","NOMBRE",{"$f":"BASE!E2","v":"E-MAIL"},{"$f":"BASE!F2","v":"NUMERO TELEFONICO"},{"$f":"BASE!C2","v":"SEMESTRE"},{"$f":"BASE!D2","v":"GRUPO"},"PROMEDIO DEL SEMESTRE"]
[null,"B130012",{"$f":"LOOKUP(B3,BASE!A3:A17,BASE!B3:B17)","v":"JUAN JOSE PEDROSA MENDEZ"},{"$f":"LOOKUP(B3,BASE!A3:A17,BASE!E3:E17)","v":"juan@hotmail.com"},{"$f":"LOOKUP(B3,BASE!A3:A17,BASE!F3:F17)","v":9621789542},{"$f":"LOOKUP('INF. DE ALUMNO'!B3,BASE!A3:A17,BASE!C3:C17)","v":2},{"$f":"LOOKUP(B3,BASE!A3:A17,BASE!D3:D17)","v":"K"},{"$f":"LOOKUP(B3,CALIFICACIONES!A5:A19,CALIFICACIONES!AV5:AV19)","v":9.43},{"$f":"IF(H3<6,\"REPROBADO\",\"APROBADO\")","v":"APROBADO"}]

{"sheet":"INF. DE SALON","index":3,"n_rows":18,"n_cols":11,"rows_kept":18,"cut":false,"hidden":false,"merged":[[17,4,17,6],[13,1,13,4],[13,6,13,9],[1,1,1,5],[9,1,9,5],[1,6,1,10],[9,6,9,10],[8,1,8,4],[8,6,8,9]]}
[]
[null,"SILLAS",null,null,null,null,"ESCRITORIOS"]
[null,"SALON","N° DE SILLA","MARCA","PRECIO","TOTAL","SALON","N° DE ESCRITORIOS","MARCA","PRECIO","TOTAL"]
[null,"2°C",30,"MIRADO",150,{"$f":"C4*E4","v":4500},"2°C",9,"MIRADO",220,{"$f":"H4*J4","v":1980}]
[null,"4°C",50,"DIAMANTE",300,{"$f":"C5*E5","v":15000},"4°C",6,"AX",220,{"$f":"H5*J5","v":1320}]
[null,"6°C",13,"PINOS",250,3250,"6°C",7,"KIU",220,1540]
[null,"3°B",22,"RBI",400,8800,"3°B",4,"IVM",220,880]
[null,"8°A",12,"ZOS",150,1800,"8°A",6,"FOX",220,1320]
[null,"ACTIVO TOTAL",null,null,null,{"$f":"SUM(F4:F8)","v":33350},"ACTIVO TOTAL",null,null,null,{"$f":"SUM(K4:K8)","v":7040}]
[null,"COMPUTADORAS",null,null,null,null,"PIZARRONES ELECTRICOS"]
[null,"SALON","N° DE COMPUTADORAS","MARCA","PRECIO","TOTAL","SALON","N° DE PIZARRONES","MARCA","PRECIO","TOTAL"]
[null,"LABORATORIO LINUX A",60,"DELL",6000,{"$f":"C12*E12","v":360000},"AUDIOVISUAL",2,"APPLE",15000,{"$f":"H12*J12","v":30000}]
[null,"LABORATORIO LINUX B",36,"APPLE",15000,{"$f":"C13*E13","v":540000},"CENTRO COMPUTACIONAL ESPECIALIZADO",2,"HP",10000,{"$f":"H13*J13","v":20000}]
[null,"TOTAL ACTIVO",null,null,null,{"$f":"SUM(F12:F13)","v":900000},"TOTAL ACTIVO",null,null,null,{"$f":"SUM(K12:K13)","v":50000}]
[]
[null,null,null,null,null,"TOTAL DE ACTIVOS"]
[null,null,null,null,null,{"$f":"SUM(F9+K9+F14+K14)","v":990390}]
[null,null,null,null,{"$f":"PESOSMN(F17)","v":" ( NOVECIENTOS NOVENTA MIL TRESCIENTOS NOVENTA PESOS 00/100 M.N.)"}]

{"sheet":"SUELDO DE PROFESORES","index":4,"n_rows":5,"n_cols":7,"rows_kept":5,"cut":false,"hidden":false,"merged":[]}
[]
[]
[]
[null,{"$f":"BASE!I2","v":"N° DE PLAZA"},{"$f":"BASE!J2","v":"PROFESOR"},{"$f":"BASE!K2","v":"MATERIA"},{"$f":"BASE!L2","v":"SUELDO "},{"$f":"BASE!M2","v":"CREDITOS"},{"$f":"BASE!N2","v":"SUELDO TOTAL MENSUAL"}]
[null,"N°2525252225",{"$f":"LOOKUP(B5,BASE!I3:I10,BASE!J3:J10)","v":"CARLOS ALESSIO PEREZ"},{"$f":"LOOKUP(B5,BASE!I3:I10,BASE!K3:K10)","v":"INGLES"},{"$f":"LOOKUP(B5,BASE!I3:I10,BASE!L3:L10)","v":5000},{"$f":"LOOKUP(B5,BASE!I3:I10,BASE!M3:M10)","v":500},{"$f":"LOOKUP(B5,BASE!I3:I10,BASE!N3:N10)","v":5500}]

{"sheet":"INSCRIPCION","index":5,"n_rows":25,"n_cols":13,"rows_kept":25,"cut":false,"hidden":false,"merged":[[2,4,3,11],[21,7,21,9],[24,7,24,9],[15,7,15,9],[6,7,6,8],[9,7,9,9],[12,7,12,9],[18,7,18,9]]}
[]
[]
[null,null,null,null,"PAGOS DE INSCRIPCION"]
[]
[]
[]
[null,null,null,null,"MATRICULA",null,null,"B130052",null,null,null,null,"PAGO"]
[null,null,null,null,null,null,null,null,null,null,null,null,{"$f":"LOOKUP(H13,BASE!C31:C39,BASE!D31:D39)","v":750}]
[]
[null,null,null,null,"NOMBRE",null,null,{"$f":"LOOKUP(INSCRIPCION!H7,BASE!A20:A28,BASE!B20:B28)","v":"AGUILAR PEREZ MARIO"}]
[]
[]
[null,null,null,null,"SEMESTRE",null,null,{"$f":"LOOKUP(H7,BASE!A20:A28,BASE!C20:C28)","v":1}]
[]
[]
[null,null,null,null,"GRUPO",null,null,{"$f":"LOOKUP(H7,BASE!A20:A28,BASE!D20:D28)","v":"A"}]
[]
[]
[null,null,null,null,"LICENCIATURA",null,null,{"$f":"LOOKUP(H7,BASE!A20:A28,BASE!G20:G28)","v":"CONTADURIA"}]
[]
[]
[null,null,null,null,"E-MAIL",null,null,{"$f":"LOOKUP(H7,BASE!A20:A28,BASE!E20:E28)","v":"perez_34@hotmail.com"}]
[]
[]
[null,null,null,null,"TELEFONO",null,null,{"$f":"LOOKUP(H7,BASE!A20:A28,BASE!F20:F28)","v":9621789542}]

{"sheet":"BOLETAS","index":6,"n_rows":20,"n_cols":11,"rows_kept":20,"cut":false,"hidden":false,"merged":[[19,9,19,11],[16,7,16,8],[11,7,11,8],[8,7,8,8],[1,5,2,10],[10,5,10,9],[12,6,12,8],[13,6,13,8],[14,6,14,8],[15,6,15,8]]}
[]
[null,null,null,null,null,"BOLETAS"]
[]
[]
[]
[null,null,null,null,null,"MATRICULA",null,"B130012"]
[]
[]
[null,null,null,null,null,"NOMBRE",null,{"$f":"LOOKUP(H6,CALIFICACIONES!A5:A19,CALIFICACIONES!B5:B19)","v":"JUAN JOSE PEDROSA MENDEZ"}]
[]
[null,null,null,null,null,"MATERIAS",null,null,null,null,"CALIFICACION"]
[]
[null,null,null,null,null,null,{"$f":"CALIFICACIONES!D2","v":"PROCESO CONTABLE"},null,null,null,{"$f":"LOOKUP(BOLETAS!H6,CALIFICACIONES!A5:A19,CALIFICACIONES!Q5:Q19)","v":8.9499999999999993}]
[null,null,null,null,null,null,{"$f":"CALIFICACIONES!R2","v":"DERECHO"},null,null,null,{"$f":"LOOKUP(H6,CALIFICACIONES!A5:A19,CALIFICACIONES!AA5:AA19)","v":9.1999999999999993}]
[null,null,null,null,null,null,{"$f":"CALIFICACIONES!AB2","v":"MATEMATICAS"},null,null,null,{"$f":"LOOKUP(H6,CALIFICACIONES!A5:A19,CALIFICACIONES!AK5:AK19)","v":9.82}]
[null,null,null,null,null,null,{"$f":"CALIFICACIONES!AL2","v":"HERRAMIENTAS AVANZADAS DE COMPUTACION"},null,null,null,{"$f":"LOOKUP(H6,CALIFICACIONES!A5:A19,CALIFICACIONES!AU5:AU19)","v":9.75}]
[]
[]
[null,null,null,null,null,null,null,null,"PROMEDIO DEL SEMESTRE",null,{"$f":"LOOKUP(H6,CALIFICACIONES!A5:A19,CALIFICACIONES!AV5:AV19)","v":9.43}]
[null,null,null,null,null,null,null,null,null,{"$f":"IF(K19<6,\"REPROBADO\",\"APROBADO\")","v":"APROBADO"}]

{"sheet":"DATOS DEL ALUMNOS DE NUEVO ING.","index":7,"n_rows":16,"n_cols":7,"rows_kept":16,"cut":false,"hidden":false,"merged":[[1,2,1,4],[13,2,13,4],[15,2,15,4]]}
[]
[null,null,"ALUMNOS DE NUEVO INGRESO"]
[]
[]
[null,"NOMBRE",null,"LUGAR DE NACIMIENTO ",null,null,"ESTADO"]
[]
[null,"AGUILAR PEREZ MARIO",null,{"$f":"LOOKUP('DATOS DEL ALUMNOS DE NUEVO ING.'!B7,BASE!Q3:Q19,BASE!R3:R19)","v":"CACAHUATAN"},null,null,{"$f":"LOOKUP(B7,BASE!Q3:Q19,BASE!T3:T19)","v":"CHIAPAS"}]
[]
[]
[null,"FECHA DE NACIMIENTO",null,"EDAD",null,null,"SEXO"]
[]
[null,{"$f":"LOOKUP(D7,BASE!R3:R19,BASE!U3:U19)","v":"2014-02-09"},null,{"$f":"LOOKUP(B7,BASE!Q3:Q19,BASE!V3:V19)","v":18},null,null,{"$f":"LOOKUP(B7,BASE!Q3:Q19,BASE!W3:W19)","v":"H"}]
[]
[null,"CARRERA ELEGIDA","PROMEDIO DE EXAMEN DE SELECCIÓN"]
[]
[null,{"$f":"LOOKUP(B7,BASE!Q3:Q19,BASE!X3:X19)","v":"SISTEMAS"},{"$f":"LOOKUP(B7,BASE!Q3:Q19,BASE!AD4:AD19)","v":8}]

{"sheet":"HORARIO DE TALLER","index":8,"n_rows":3,"n_cols":8,"rows_kept":3,"cut":false,"hidden":false,"merged":[]}
[]
[null,{"$f":"BASE!A42","v":"MATRICULA"},{"$f":"BASE!B42","v":"NOMBRE"},{"$f":"BASE!C42","v":"SEMESTRE"},{"$f":"BASE!D42","v":"GRUPO"},{"$f":"BASE!G42","v":"LICENCIATURA"},{"$f":"BASE!H42","v":"TALLER CULTURAL"},{"$f":"BASE!I42","v":"HORARIO DEL TALLER CULTURAL"}]
[null,"Hernandez Lopez Vanesa",{"$f":"LOOKUP('HORARIO DE TALLER'!B3,BASE!A43:A55,BASE!B43:B55)","v":"Salgado Molina Alexis Amin"},{"$f":"LOOKUP(B3,BASE!A43:A55,BASE!C43:C55)","v":2},{"$f":"LOOKUP(B3,BASE!A43:A55,BASE!D43:D55)","v":"C"},{"$f":"LOOKUP(B3,BASE!A43:A55,BASE!G43:G55)","v":"CONTADURIA"},{"$f":"LOOKUP(B3,BASE!A43:A55,BASE!H43:H55)","v":"FLAUTA"},{"$f":"LOOKUP(B3,BASE!A43:A55,BASE!I43:I55)","v":"LUNES 13:00-15:00 HRS"}]

{"sheet":"INVENTARIO","index":9,"n_rows":15,"n_cols":7,"rows_kept":15,"cut":false,"hidden":false,"merged":[[2,1,2,6]]}
[]
[]
[null,"INVENTARIO"]
[null,{"$f":"BASE!I20","v":"MOBILIARIO O EQUIPO"},{"$f":"BASE!J20","v":"CANTIDAD"},{"$f":"BASE!K20","v":"AÑO DE EQUIPAMIENTO"},{"$f":"BASE!L20","v":"PROVEEDORES"},{"$f":"BASE!M20","v":"PRECIO UNITARIO"},"CONCEPTO"]
[null,{"$f":"BASE!I21","v":"VENTANAS"},{"$f":"BASE!J21","v":10},{"$f":"BASE!K21","v":2010},{"$f":"BASE!L21","v":"HOME DEPOT"},{"$f":"BASE!M21","v":500},{"$f":"IF(D6<2011,\"EN BUEN ESTADO\",\"EN MAL ESTADO\")","v":"EN MAL ESTADO"}]
[null,{"$f":"BASE!I22","v":"ESCRITORIOS"},{"$f":"BASE!J22","v":30},{"$f":"BASE!K22","v":2012},{"$f":"BASE!L22","v":"OFFICE DEPOT"},{"$f":"BASE!M22","v":600},{"$f":"IF(D7>2011,\"EN BUEN ESTADO\",\"EN MAL ESTADO\")","v":"EN MAL ESTADO"}]
[null,{"$f":"BASE!I23","v":"COMPUTADORAS"},{"$f":"BASE!J23","v":50},{"$f":"BASE!K23","v":2011},{"$f":"BASE!L23","v":"DELL"},{"$f":"BASE!M23","v":300},"EN MAL ESTADO"]
[null,{"$f":"BASE!I24","v":"PIZARRONES"},{"$f":"BASE!J24","v":66},{"$f":"BASE!K24","v":2010},{"$f":"BASE!L24","v":"MARKER"},{"$f":"BASE!M24","v":100},"EN BUEN ESTADO"]
[null,{"$f":"BASE!I25","v":"PAPELERIA Y UTILES"},{"$f":"BASE!J25","v":50},{"$f":"BASE!K25","v":2014},{"$f":"BASE!L25","v":"TONY"},{"$f":"BASE!M25","v":200},"EN BUEN ESTADO"]
[null,{"$f":"BASE!I26","v":"IMPRESORAS"},{"$f":"BASE!J26","v":20},{"$f":"BASE!K26","v":2013},{"$f":"BASE!L26","v":"TINTA RAPIDA S.A DE C.V"},{"$f":"BASE!M26","v":300},"EN BUEN ESTADO"]
[null,{"$f":"BASE!I27","v":"LAMPARAS"},{"$f":"BASE!J27","v":44},{"$f":"BASE!K27","v":2012},{"$f":"BASE!L27","v":"LUZ S.A DE C.V"},{"$f":"BASE!M27","v":520},"EN BUEN ESTADO"]
[null,{"$f":"BASE!I28","v":"AIRE ACONDICIONADO"},{"$f":"BASE!J28","v":99},{"$f":"BASE!K28","v":2012},{"$f":"BASE!L28","v":"CLIMAFRESCO S.A DE C.V"},{"$f":"BASE!M28","v":800},"EN MAL ESTADO"]
[null,{"$f":"BASE!I29","v":"VENTILADORES"},{"$f":"BASE!J29","v":30},{"$f":"BASE!K29","v":2011},{"$f":"BASE!L29","v":"VENTILADORES DEL SUR S.A DE C.V"},{"$f":"BASE!M29","v":600},"EN BUEN ESTADO"]
[null,{"$f":"BASE!I30","v":"PUPITRES"},{"$f":"BASE!J30","v":3},{"$f":"BASE!K30","v":2013},{"$f":"BASE!L30","v":"LOS PINOS S.A DE C.V"},{"$f":"BASE!M30","v":200},"EN MAL ESTADO"]
[null,{"$f":"BASE!I31","v":"MESABANCOS"},{"$f":"BASE!J31","v":55},{"$f":"BASE!K31","v":2010},{"$f":"BASE!L31","v":"MOBI S.A DE C.V"},{"$f":"BASE!M31","v":400},"EN MAL ESTADO"]

{"sheet":"ALUMNOS PARA BECA","index":10,"n_rows":5,"n_cols":9,"rows_kept":5,"cut":false,"hidden":false,"merged":[[4,2,4,5],[7,2,7,4],[8,2,8,4],[4,8,4,9],[3,8,3,9],[3,2,3,5],[3,6,3,7],[4,6,4,7]]}
[]
[]
[]
[null,"MATRICULA","NOMBRE",null,null,null,"PROMEDIO",null,"CANDIDATO A BECA"]
[null,"B130012",{"$f":"LOOKUP(B5,CALIFICACIONES!A5:A19,CALIFICACIONES!B5:B19)","v":"JUAN JOSE PEDROSA MENDEZ"},null,null,null,{"$f":"LOOKUP(B5,CALIFICACIONES!A5:A19,CALIFICACIONES!AV5:AV19)","v":9.43},null,{"$f":"IF(G5>9.4,\"BECADO\",\"SIGUE PARTICIPANDO\")","v":"BECADO"}]